{"text_format":"1","workbook":"xlsx","n_sheets":4,"sheets":["Project Information","SBUH Model","SCS,SBUH Equations","Lookups, Constants"],"not_rendered":{"charts":0,"images":1,"macros":1,"external_links":0,"defined_names":22,"comments":1,"pivot_tables":0},"unopened":[],"bounds":{"document_bytes":16777216,"sheet_cells":100000,"rows_first":2000,"rows_last":500,"rows_between":2000,"halvings":0,"cell_chars":16384,"cell_head_chars":4096},"cells_cut":0,"cells_raw":0,"read":"whole","date_system":"1900"}

{"sheet":"Project Information","index":0,"n_rows":46,"n_cols":16,"rows_kept":46,"cut":false,"hidden":false,"merged":[[45,0,45,1],[40,0,40,1],[39,0,39,1],[38,0,38,1],[6,2,6,3],[7,2,7,3],[22,0,22,1],[21,0,21,1],[19,0,19,1],[20,0,20,1],[30,0,30,1],[43,0,43,1],[32,0,32,1],[31,0,31,1],[44,0,44,1]]}
[null,"Central Coast Region"]
[null,"Stormwater Control Measure"]
[null,"Sizing Calculator",null,null,null,null,null,null,"Version: 7/2/2018"]
[]
[]
[null,"1. Project Information",null,null,null,null,null,null,null,null,null,null,null,null,"Ranges","Row"]
[null,"Project name: ",null,null,null,null,null,null,null,null,null,null,null,null,"DMA-UL",{"$f":"ROW(start_DMA)+1","v":21}]
[null,"Project location: ",null,null,null,null,null,null,null,null,null,null,null,null,"DMA-LR",{"$f":"ROW(end_DMA)-1","v":21}]
[null,"Tier 2/Tier 3: ",null,"Tier 3 - Retention",null,null,null,null,null,null,null,null,null,null,"SCM-UL",{"$f":"ROW(start_SCM)+1","v":32}]
[null,"Design rainfall depth (in): ",null,null,null,null,null,null,null,null,null,null,null,null,"SCM-LR",{"$f":"ROW(end_SCM)-1","v":32}]
[null,"Total project area (ft2): ",null,null,{"$f":"IF(D11=0,\"\",IF(ABS((D11-(D12+D17))/D11)<0.02,\"\",\"Check Total DMA and SCM areas to ensure they match total project area\"))","v":""},null,null,null,null,null,null,null,null,null,"OUT-UL",{"$f":"ROW(start_Output)+1","v":40}]
[null,"Total DMA area (ft2): ",null,{"$f":"SUM(D13:D16)","v":0},null,null,null,null,null,null,null,null,null,null,"OUT-LR",{"$f":"ROW(end_Output)-1","v":40}]
[null,"Total new impervious area (ft2): "]
[null,"Total replaced impervious within a USA (ft2): "]
[null,"Total replaced impervious not in a USA (ft2): "]
[null,"Total pervious/landscape area (ft2): "]
[null,"Total SCM area (ft2): "]
[]
[null,"2. DMA Characterization"]
["Name",null,"DMA Type","Area (ft2)","Surface Type","New, Replaced?","Connection",null,null,"CN","SCM CODE (DMA_CN_Weight)"]
[null,null,null,null,null,null,null,null,null,{"$f":"IF(E21=\"\",\"\",VLOOKUP(E21,'Lookups, Constants'!$A$14:$B$23,2,FALSE))","v":""},{"$f":"IF(J21=\"\",\"\",IF(J21=98,G21 & \"_\" & VLOOKUP(C21,'Lookups, Constants'!$A$4:$B$7,2,FALSE)&\"_\"&VLOOKUP(F21,'Lookups, Constants'!$A$44:$B$46,2,FALSE),G21 & \"_\" & J21))","v":""}]
["end_DMA"]
["DMA Summary Area Check"]
[null,"Total assigned DMA area (ft2): ",null,{"$f":"SUM(IF($C$21:C22=\"Drains to SCM\",IF(LEN($G$21:G22)>0,$D$21:D22,0),0))+SUM(IF($C$21:C22=\"Self-Treating\",$D$21:D22,0))+SUM(IF($C$21:C22=\"Self-Retaining\",$D$21:D22,0))+SUM(IF($C$21:C22=\"Drains to Self-Retaining\",IF(LEN($G$21:G22)>0,$D$21:D22,0),0))","v":0},{"$f":"IF(D12=0,IF(D12<>0,\"Check 'DMA to SCM connections' and DMA table areas against plan sheet areas\",\"\"),IF(ABS(D12-D24)/D12>0.02,\"Check 'DMA to SCM connections' DMA table areas against plan sheet areas\",\"\"))","v":""}]
[null,"New impervious area (ft2): ",null,{"$f":"SUM(IF($J$21:J22=98,IF($F$21:F22=\"New\",$D$21:D22,0),0))+SUM(IF($J$21:J22=98,IF($C$21:C22=\"Drains to Self-Retaining\",$D$21:D22,0),0))","v":0},{"$f":"IF(D25=0,IF(D13<>0,\"Check DMA table areas against plan sheet areas\",\"\"),IF(D13=0,\"Check DMA table areas against plan sheet areas\",IF(ABS(D13-D25)/D13>0.02,\"Check DMA table areas against plan sheet areas\",\"\")))","v":""}]
[null,"Replaced impervious within a USA (ft2): ",null,{"$f":"SUM(IF($J$21:J22=98,IF($F$21:F22=\"Replaced within a USA\",$D$21:D22,0),0))","v":0},{"$f":"IF(D26=0,IF(D14<>0,\"Check DMA table areas against plan sheet areas\",\"\"),IF(D14=0,\"Check DMA table areas against plan sheet areas\",IF(ABS(D14-D26)/D14>0.02,\"Check DMA table areas against plan sheet areas\",\"\")))","v":""}]
[null,"Replaced impervious not in a USA (ft2): ",null,{"$f":"SUM(IF($J$21:J22=98,IF($F$21:F22=\"Replaced\",$D$21:D22,0),0))","v":0},{"$f":"IF(D27=0,IF(D15<>0,\"Check DMA table areas against plan sheet areas\",\"\"),IF(D15=0,\"Check DMA table areas against plan sheet areas\",IF(ABS(D15-D27)/D15>0.02,\"Check DMA table areas against plan sheet areas\",\"\")))","v":""}]
[null,"Total pervious/landscape area (ft2): ",null,{"$f":"SUM(IF($C$21:C22=\"Drains to SCM\",IF($J$21:J22<98,$D$21:D22,0),0))+SUM(IF($C$21:C22=\"Self-Treating\",$D$21:D22,0))+SUM(IF($C$21:C22=\"Self-Retaining\",$D$21:D22,0))","v":0},{"$f":"IF(D28=0,IF(D16<>0,\"Check DMA table areas against plan sheet areas\",\"\"),IF(D16=0,\"Check DMA table areas against plan sheet areas\",IF(ABS(D16-D28)/D16>0.02,\"Check DMA table areas against plan sheet areas\",\"\")))","v":""}]
[null,null,null,null,null,null,null,null,null,null,"_2SCM_NEW","_2SCM_RUSA","_2SCM_RPL","_68","_89"]
[null,"3. SCM Characterization",null,null,null,null,null,"Flow Control","Reservoir",null,"New Imp Area","Rpl Imp USA","Rpl Imp non-USA","Landscape","Solid unit pavers","SUM"]
["Name",null,"SCM Type","Safety Factor","SCM Soil Type","Infilt. Rate (in/hr)","Area (ft2)","Orifice?","Depth (in)"]
[null,null,null,{"$f":"IF(C32=\"\",\"\",IF(C32=\"Bioretention\",1,2))","v":""},null,null,null,null,null,{"$f":"IF(A32=\"\",\"\",A32)","v":""},{"$f":"IF(J32=\"\",\"\",SUMIF($K$21:$K$22,$A32 & K$29,$D$21:$D$22))","v":""},{"$f":"IF(J32=\"\",\"\",SUMIF($K$21:$K$22,$A32 & L$29,$D$21:$D$22))","v":""},{"$f":"IF(J32=\"\",\"\",SUMIF($K$21:$K$22,$A32 & M$29,$D$21:$D$22))","v":""},{"$f":"IF(J32=\"\",\"\",SUMIF($K$21:$K$22,$A32 & N$29,$D$21:$D$22))","v":""},{"$f":"IF(J32=\"\",\"\",SUMIF($K$21:$K$22,$A32 & O$29,$D$21:$D$22))","v":""},{"$f":"SUM(K32:O32)","v":0}]
["end_SCM",null,{"$f":"IF(D17=0,\"\",IF(ABS(D17-SUM($G$32:G33))/D17>0.02,\"Note: SCM areas in 'Project Information' and 'SCM Characterization' blocks differ by more than 2%. Please check.\",\"\"))","v":""},null,null,null,null,null,null,null,{"$f":"IF(J33=\"\",\"\",SUMIF($K$21:$K$22,$A33 & K$29,$D$21:$D$22))","v":""},{"$f":"IF(J33=\"\",\"\",SUMIF($K$21:$K$22,$A33 & L$29,$D$21:$D$22))","v":""},{"$f":"IF(J33=\"\",\"\",SUMIF($K$21:$K$22,$A33 & M$29,$D$21:$D$22))","v":""},{"$f":"IF(J33=\"\",\"\",SUMIF($K$21:$K$22,$A33 & N$29,$D$21:$D$22))","v":""},{"$f":"IF(J33=\"\",\"\",SUMIF($K$21:$K$22,$A33 & O$29,$D$21:$D$22))","v":""}]
[null,"4. Run SBUH Model"]
[]
[]
[]
[null,"5. SCM Minimum Sizing Requirements"]
["SCM Name",null,"Min. Required Storage Vol. (ft3)","Depth Below Underdrain (ft)","Drain Time (hours)","Orifice Diameter (in)"]
[]
["end_Output"]
[]
[null,"6. Self-Retaining Area Sizing Checks"]
["Self-Retaining DMA Name",null,"Self-Retaining DMA Area (ft2)","Tributary DMA Name(s)","Eff. Tributary DMA Area (ft2)","Effective Tributary / SRA Area Ratio "]
[]
["end_SRA"]

{"sheet":"SBUH Model","index":1,"n_rows":1221,"n_cols":16,"rows_kept":1221,"cut":false,"hidden":false,"merged":[[18,4,18,5],[18,6,18,7],[18,8,18,9]]}
["scm 1"]
[]
["SBUH Parameters: ",null,null,null,null,null,null,null,null,"Runoff to SCM: ",null,null,"SCM Parameters: "]
[null,null,"Design rainfall depth (in) = ",{"$f":"'Project Information'!$D$10","v":0},null,null,null,null,null,"Total runoff (in) = ",{"$f":"D4*(SUM(D8:D10)*E17+D11*G17+D12*I17)/SUM(D8:D12)","v":{"$error":"#DIV/0!"}},null,null,"Plan area (ft2) = ",1000]
[null,null,"Model time step (min) = ",{"$f":"A22-A21","v":6},null,null,null,null,null,"Total runoff (ft3) = ",{"$f":"D4*(SUM(D8:D10)*E17+D11*G17+D12*I17)/12","v":{"$error":"#DIV/0!"}},null,null,"Sizing factor = ",{"$f":"O4/SUM(D8:D12)","v":0.1}]
[]
[null,null,"DMA Summary","Area (ft2)","CN","S","Weighting ","Imp. Weighting",null,null,null,null,null,"Design infiltration rate (in/hr) = ",0.25]
[null,null,"New impervious area: ",10000,98,{"$f":"(1000/E8)-10","v":0.20408163265306101},1,1,null,null,null,null,null,"Safety factor = ",1]
[null,null,"Replaced impervious in USA: ",0,98,{"$f":"(1000/E9)-10","v":0.20408163265306101},0,1,null,null,null,null,null,"SCM Exfiltration rate (cfs) = ",{"$f":"O4*(O7/12/3600)/O8","v":5.7870370370370367E-3}]
[null,null,"Replaced impervious not USA: ",0,98,{"$f":"(1000/E10)-10","v":0.20408163265306101},0.5,1,null,null,null,null,null,"Drainage time (hours) = ",{"$f":"(VLOOKUP(1440,A21:P1221,16)/O9)/3600","v":{"$error":"#DIV/0!"}}]
[null,null,"Landscape area: ",0,68,{"$f":"(1000/E11)-10","v":4.7058823529411757},1,{"$f":"G17/E17","v":{"$error":"#DIV/0!"}},null,null,null,null,null,"Minimum storage volume (ft3) = ",{"$f":"MAX(O4*1*'Lookups, Constants'!$F$3,MAX(P21:P1221)*IF(O10>48,1.2,1))","v":{"$error":"#DIV/0!"}}]
[null,null,"Solid unit pavers set in sand: ",0,89,{"$f":"(1000/E12)-10","v":1.2359550561797761},1,{"$f":"I17/E17","v":{"$error":"#DIV/0!"}},null,null,null,null,null,"Gravel volume (ft3) = ",{"$f":"O11/'Lookups, Constants'!$F$3","v":{"$error":"#DIV/0!"}}]
[null,null,"Non-runoff generating area: ",{"$f":"SUMIF('Project Information'!$J$21:J22,\"<69\",'Project Information'!$D$21:D22)","v":0},"N/A","N/A",0,0,null,null,null,null,null,"Gravel depth (ft) = ",{"$f":"MAX(1,O12/O4)","v":{"$error":"#DIV/0!"}}]
[null,null,"Weighted impervious (ft2) = ",{"$f":"SUMPRODUCT(D8:D13,H8:H13)","v":{"$error":"#DIV/0!"}}]
[null,null,"Travel path length (ft) = ",{"$f":"SQRT(2*SUM(D8,D11:D13))","v":141.42135623730951},null,null,null,null,null,null,null,null,null,null,"% inflow that "]
[null,null,"Time of concentration (min) = ",{"$f":"MAX(5,60*0.007*(0.011*D15)^0.8/D4^0.5/0.005^0.4)","v":{"$error":"#DIV/0!"}},"(rain/runoff)",null,"(rain/runoff)",null,"(rain/runoff)",null,null,null,"runoff %","direct rain vol","is exfiltrated","(max/total vol.)"]
[null,null,null,null,{"$f":"MAX(E21:E1221)/$D$4","v":{"$error":"#DIV/0!"}},null,{"$f":"MAX(G21:G1221)/$D$4","v":{"$error":"#DIV/0!"}},null,{"$f":"MAX(I21:I1221)/$D$4","v":{"$error":"#DIV/0!"}},null,null,null,{"$f":"SUM(M21:M741)/(($D$4/12)*SUM(D$8:D$12))","v":{"$error":"#DIV/0!"}},{"$f":"SUM(N21:N741)","v":0},{"$f":"-SUM(O21:O741)/SUM(M21:N741)","v":{"$error":"#DIV/0!"}},{"$f":"MAX(P21:P741)/SUM($M$21:$N$741)","v":{"$error":"#DIV/0!"}}]
["SBUH Runoff Calculations",null,null,null,null,null,null,null,null,null,null,null,"Bioretention Hydraulics"]
[null,null,null,null,"Impervious",null,"Landscape",null,"Solid unit pavers set in sand"]
["Time (minutes)","Distribution \n(Type I)","Rainfall Depth (in)","Cumulative Rainfall (in)","Cumulative Runoff Depth (in)","Instantaneous Runoff (in)","Cumulative Runoff Depth (in)","Instantaneous Runoff (in)","Cumulative Runoff Depth (in)","Instantaneous Runoff (in)","Instantaneous Runoff Rate (cfs)","Routed Flow Rate (cfs)","Stormwater Inflow (ft3)","Direct Rain (ft3)","Exfiltration Outflow (ft3)","Bioretention Water Volume (ft3)"]
[0,0,{"$f":"$D$4*'SBUH Model'!B21","v":0},{"$f":"C21","v":0},{"$f":"IF(D21<0.2*F$8,0,(D21-0.2*F$8)^2/(D21+0.8*F$8))","v":0},0,{"$f":"IF(D21<0.2*F$11,0,(D21-0.2*F$11)^2/(D21+0.8*F$11))","v":0},0,{"$f":"IF(D21<0.2*F$12,0,(D21-0.2*F$12)^2/(D21+0.8*F$12))","v":0},0,{"$f":"((F21/12)*SUMPRODUCT(D$8:D$10,G$8:G$10)+(H21/12)*D$11+(J21/12)*D$12)/($D$5*60)","v":0},0,{"$f":"L21*($D$5*60)","v":0},{"$f":"(C21/12)*O$4","v":0},0,0]
[{"$f":"A21+6","v":6},1.74E-3,{"$f":"$D$4*'SBUH Model'!B22","v":0},{"$f":"C22+D21","v":0},{"$f":"IF(D22<0.2*F$8,0,(D22-0.2*F$8)^2/(D22+0.8*F$8))","v":0},{"$f":"MAX(0,E22-E21)","v":0},{"$f":"IF(D22<0.2*F$11,0,(D22-0.2*F$11)^2/(D22+0.8*F$11))","v":0},{"$f":"MAX(0,G22-G21)","v":0},{"$f":"IF(D22<0.2*F$12,0,(D22-0.2*F$12)^2/(D22+0.8*F$12))","v":0},{"$f":"MAX(0,I22-I21)","v":0},{"$f":"((F22/12)*SUMPRODUCT(D$8:D$10,G$8:G$10)+(H22/12)*D$11+(J22/12)*D$12)/($D$5*60)","v":0},{"$f":"MAX(0,L21+(D$5/(2*D$16+D$5))*(K21+K22-2*L21))","v":{"$error":"#DIV/0!"}},{"$error":"#DIV/0!"},0,{"$f":"-MIN(O$9*D$5*60,SUM(M22,N22,P21))","v":{"$error":"#DIV/0!"}},{"$f":"P21+SUM(M22:O22)","v":{"$error":"#DIV/0!"}}]
[{"$f":"A22+6","v":12},1.7419999999999998E-3,{"$f":"$D$4*'SBUH Model'!B23","v":0},0,0,{"$f":"MAX(0,E23-E22)","v":0},0,0,0,0,{"$f":"((F23/12)*SUMPRODUCT(D$8:D$10,G$8:G$10)+(H23/12)*D$11+(J23/12)*D$12)/($D$5*60)","v":0},{"$f":"MAX(0,L22+(D$5/(2*D$16+D$5))*(K22+K23-2*L22))","v":{"$error":"#DIV/0!"}},{"$error":"#DIV/0!"},0,{"$error":"#DIV/0!"},{"$f":"P22+SUM(M23:O23)","v":{"$error":"#DIV/0!"}}]
[18,1.7420000000000005E-3,{"$f":"$D$4*'SBUH Model'!B24","v":0},0,0,0,0,0,0,0,0,{"$error":"#DIV/0!"},{"$error":"#DIV/0!"},0,{"$error":"#DIV/0!"},{"$error":"#DIV/0!"}]
[24,1.7439999999999999E-3,{"$f":"$D$4*'SBUH Model'!B25","v":0},0,0,0,0,0,0,0,0,{"$error":"#DIV/0!"},{"$error":"#DIV/0!"},0,{"$error":"#DIV/0!"},{"$error":"#DIV/0!"}]
[30,1.743999999999999E-3,{"$f":"$D$4*'SBUH Model'!B26","v":0},0,0,0,0,0,0,0,0,{"$error":"#DIV/0!"},{"$error":"#DIV/0!"},0,{"$error":"#DIV/0!"},{"$error":"#DIV/0!"}]
[36,1.746000000000001E-3,{"$f":"$D$4*'SBUH Model'!B27","v":0},0,0,0,0,0,0,0,0,{"$error":"#DIV/0!"},{"$error":"#DIV/0!"},0,{"$error":"#DIV/0!"},{"$error":"#DIV/0!"}]
[42,1.7459999999999993E-3,{"$f":"$D$4*'SBUH Model'!B28","v":0},0,0,0,0,0,0,0,0,{"$error":"#DIV/0!"},{"$error":"#DIV/0!"},0,{"$error":"#DIV/0!"},{"$error":"#DIV/0!"}]
[48,1.7480000000000013E-3,{"$f":"$D$4*'SBUH Model'!B29","v":0},0,0,0,0,0,0,0,0,{"$error":"#DIV/0!"},{"$error":"#DIV/0!"},0,{"$error":"#DIV/0!"},{"$error":"#DIV/0!"}]
[54,1.7479999999999978E-3,{"$f":"$D$4*'SBUH Model'!B30","v":0},0,0,0,0,0,0,0,0,{"$error":"#DIV/0!"},{"$error":"#DIV/0!"},0,{"$error":"#DIV/0!"},{"$error":"#DIV/0!"}]
[60,1.7500000000000016E-3,{"$f":"$D$4*'SBUH Model'!B31","v":0},0,0,0,0,0,0,0,0,{"$error":"#DIV/0!"},{"$error":"#DIV/0!"},0,{"$error":"#DIV/0!"},{"$error":"#DIV/0!"}]
[66,1.7499999999999981E-3,{"$f":"$D$4*'SBUH Model'!B32","v":0},0,0,0,0,0,0,0,0,{"$error":"#DIV/0!"},{"$error":"#DIV/0!"},0,{"$error":"#DIV/0!"},{"$error":"#DIV/0!"}]
[72,1.7520000000000001E-3,{"$f":"$D$4*'SBUH Model'!B33","v":0},0,0,0,0,0,0,0,0,{"$error":"#DIV/0!"},{"$error":"#DIV/0!"},0,{"$error":"#DIV/0!"},{"$error":"#DIV/0!"}]
[78,1.7520000000000001E-3,{"$f":"$D$4*'SBUH Model'!B34","v":0},0,0,0,0,0,0,0,0,{"$error":"#DIV/0!"},{"$error":"#DIV/0!"},0,{"$error":"#DIV/0!"},{"$error":"#DIV/0!"}]
[84,1.7540000000000021E-3,{"$f":"$D$4*'SBUH Model'!B35","v":0},0,0,0,0,0,0,0,0,{"$error":"#DIV/0!"},{"$error":"#DIV/0!"},0,{"$error":"#DIV/0!"},{"$error":"#DIV/0!"}]
[90,1.7539999999999986E-3,{"$f":"$D$4*'SBUH Model'!B36","v":0},0,0,0,0,0,0,0,0,{"$error":"#DIV/0!"},{"$error":"#DIV/0!"},0,{"$error":"#DIV/0!"},{"$error":"#DIV/0!"}]
[96,1.7560000000000006E-3,{"$f":"$D$4*'SBUH Model'!B37","v":0},0,0,0,0,0,0,0,0,{"$error":"#DIV/0!"},{"$error":"#DIV/0!"},0,{"$error":"#DIV/0!"},{"$error":"#DIV/0!"}]
[102,1.7560000000000006E-3,{"$f":"$D$4*'SBUH Model'!B38","v":0},0,0,0,0,0,0,0,0,{"$error":"#DIV/0!"},{"$error":"#DIV/0!"},0,{"$error":"#DIV/0!"},{"$error":"#DIV/0!"}]
[108,1.7580000000000026E-3,{"$f":"$D$4*'SBUH Model'!B39","v":0},0,0,0,0,0,0,0,0,{"$error":"#DIV/0!"},{"$error":"#DIV/0!"},0,{"$error":"#DIV/0!"},{"$error":"#DIV/0!"}]
[114,1.7579999999999957E-3,{"$f":"$D$4*'SBUH Model'!B40","v":0},0,0,0,0,0,0,0,0,{"$error":"#DIV/0!"},{"$error":"#DIV/0!"},0,{"$error":"#DIV/0!"},{"$error":"#DIV/0!"}]
[120,1.7600000000000046E-3,{"$f":"$D$4*'SBUH Model'!B41","v":0},0,0,0,0,0,0,0,0,{"$error":"#DIV/0!"},{"$error":"#DIV/0!"},0,{"$error":"#DIV/0!"},{"$error":"#DIV/0!"}]
[126,1.7749999999999988E-3,{"$f":"$D$4*'SBUH Model'!B42","v":0},0,0,0,0,0,0,0,0,{"$error":"#DIV/0!"},{"$error":"#DIV/0!"},0,{"$error":"#DIV/0!"},{"$error":"#DIV/0!"}]
[132,1.802999999999999E-3,{"$f":"$D$4*'SBUH Model'!B43","v":0},0,0,0,0,0,0,0,0,{"$error":"#DIV/0!"},{"$error":"#DIV/0!"},0,{"$error":"#DIV/0!"},{"$error":"#DIV/0!"}]
[138,1.8330000000000013E-3,{"$f":"$D$4*'SBUH Model'!B44","v":0},0,0,0,0,0,0,0,0,{"$error":"#DIV/0!"},{"$error":"#DIV/0!"},0,{"$error":"#DIV/0!"},{"$error":"#DIV/0!"}]
[144,1.8609999999999946E-3,{"$f":"$D$4*'SBUH Model'!B45","v":0},0,0,0,0,0,0,0,0,{"$error":"#DIV/0!"},{"$error":"#DIV/0!"},0,{"$error":"#DIV/0!"},{"$error":"#DIV/0!"}]
[150,1.8910000000000038E-3,{"$f":"$D$4*'SBUH Model'!B46","v":0},0,0,0,0,0,0,0,0,{"$error":"#DIV/0!"},{"$error":"#DIV/0!"},0,{"$error":"#DIV/0!"},{"$error":"#DIV/0!"}]
[156,1.9189999999999971E-3,{"$f":"$D$4*'SBUH Model'!B47","v":0},0,0,0,0,0,0,0,0,{"$error":"#DIV/0!"},{"$error":"#DIV/0!"},0,{"$error":"#DIV/0!"},{"$error":"#DIV/0!"}]
[162,1.9480000000000053E-3,{"$f":"$D$4*'SBUH Model'!B48","v":0},0,0,0,0,0,0,0,0,{"$error":"#DIV/0!"},{"$error":"#DIV/0!"},0,{"$error":"#DIV/0!"},{"$error":"#DIV/0!"}]
[168,1.9779999999999937E-3,{"$f":"$D$4*'SBUH Model'!B49","v":0},0,0,0,0,0,0,0,0,{"$error":"#DIV/0!"},{"$error":"#DIV/0!"},0,{"$error":"#DIV/0!"},{"$error":"#DIV/0!"}]
[174,2.0060000000000008E-3,{"$f":"$D$4*'SBUH Model'!B50","v":0},0,0,0,0,0,0,0,0,{"$error":"#DIV/0!"},{"$error":"#DIV/0!"},0,{"$error":"#DIV/0!"},{"$error":"#DIV/0!"}]
[180,2.0360000000000031E-3,{"$f":"$D$4*'SBUH Model'!B51","v":0},0,0,0,0,0,0,0,0,{"$error":"#DIV/0!"},{"$error":"#DIV/0!"},0,{"$error":"#DIV/0!"},{"$error":"#DIV/0!"}]
[186,2.0639999999999964E-3,{"$f":"$D$4*'SBUH Model'!B52","v":0},0,0,0,0,0,0,0,0,{"$error":"#DIV/0!"},{"$error":"#DIV/0!"},0,{"$error":"#DIV/0!"},{"$error":"#DIV/0!"}]
[192,2.0940000000000056E-3,{"$f":"$D$4*'SBUH Model'!B53","v":0},0,0,0,0,0,0,0,0,{"$error":"#DIV/0!"},{"$error":"#DIV/0!"},0,{"$error":"#DIV/0!"},{"$error":"#DIV/0!"}]
[198,2.1219999999999989E-3,{"$f":"$D$4*'SBUH Model'!B54","v":0},0,0,0,0,0,0,0,0,{"$error":"#DIV/0!"},{"$error":"#DIV/0!"},0,{"$error":"#DIV/0!"},{"$error":"#DIV/0!"}]
[204,2.1520000000000011E-3,{"$f":"$D$4*'SBUH Model'!B55","v":0},0,0,0,0,0,0,0,0,{"$error":"#DIV/0!"},{"$error":"#DIV/0!"},0,{"$error":"#DIV/0!"},{"$error":"#DIV/0!"}]
[210,2.1799999999999944E-3,{"$f":"$D$4*'SBUH Model'!B56","v":0},0,0,0,0,0,0,0,0,{"$error":"#DIV/0!"},{"$error":"#DIV/0!"},0,{"$error":"#DIV/0!"},{"$error":"#DIV/0!"}]
[216,2.2100000000000036E-3,{"$f":"$D$4*'SBUH Model'!B57","v":0},0,0,0,0,0,0,0,0,{"$error":"#DIV/0!"},{"$error":"#DIV/0!"},0,{"$error":"#DIV/0!"},{"$error":"#DIV/0!"}]
[222,2.2380000000000039E-3,{"$f":"$D$4*'SBUH Model'!B58","v":0},0,0,0,0,0,0,0,0,{"$error":"#DIV/0!"},{"$error":"#DIV/0!"},0,{"$error":"#DIV/0!"},{"$error":"#DIV/0!"}]
[228,2.2679999999999922E-3,{"$f":"$D$4*'SBUH Model'!B59","v":0},0,0,0,0,0,0,0,0,{"$error":"#DIV/0!"},{"$error":"#DIV/0!"},0,{"$error":"#DIV/0!"},{"$error":"#DIV/0!"}]
[234,2.2970000000000074E-3,{"$f":"$D$4*'SBUH Model'!B60","v":0},0,0,0,0,0,0,0,0,{"$error":"#DIV/0!"},{"$error":"#DIV/0!"},0,{"$error":"#DIV/0!"},{"$error":"#DIV/0!"}]
{"$rows_left_out":1162}
{"sheet":"SCS,SBUH Equations","index":2,"n_rows":244,"n_cols":12,"rows_kept":244,"cut":false,"hidden":false,"merged":[]}
["SCS Type I Distribution (6-min)",null,null,null,null,null,"Stormwater Runoff and Routing Equations: "]
[]
["Step","Minute","Cummulative Distribution","Incremental Distribution"]
[0,0,0,0,null,null,"Computing Runoff (SCS and SBUH are the same): "]
[1,6,1.74E-3,{"$f":"C5-C4","v":1.74E-3}]
[2,12,3.4819999999999999E-3,{"$f":"C6-C5","v":1.7419999999999998E-3}]
[3,18,5.2240000000000003E-3,1.7420000000000005E-3,null,null,null,null,null,"where: "]
[4,24,6.9680000000000002E-3,1.7439999999999999E-3,null,null,null,null,null,"R = runoff (in)"]
[5,30,8.7119999999999993E-3,1.743999999999999E-3,null,null,null,null,null,"P = rainfall (in)"]
[6,36,1.0458E-2,1.746000000000001E-3,null,null,null,null,null,"Ia = initial abstraction (in)"]
[7,42,1.2204E-2,1.7459999999999993E-3,null,null,null,null,null,"S = potential maximum soil moisture retention after runoff begins (in)"]
[8,48,1.3952000000000001E-2,1.7480000000000013E-3,null,null,null,null,null,"CN = runoff curve number"]
[9,54,1.5699999999999999E-2,1.7479999999999978E-3]
[10,60,1.745E-2,1.7500000000000016E-3]
[11,66,1.9199999999999998E-2,1.7499999999999981E-3]
[12,72,2.0951999999999998E-2,1.7520000000000001E-3]
[13,78,2.2703999999999998E-2,1.7520000000000001E-3]
[14,84,2.4458000000000001E-2,1.7540000000000021E-3,null,null,"SBUH Runoff Routing: "]
[15,90,2.6211999999999999E-2,1.7539999999999986E-3]
[16,96,2.7968E-2,1.7560000000000006E-3,null,null,null,null,null,null,null,"where: "]
[17,102,2.9724E-2,1.7560000000000006E-3,null,null,null,null,null,null,null,"It = instantaneous hydrograph (cfs)"]
[18,108,3.1482000000000003E-2,1.7580000000000026E-3,null,null,null,null,null,null,null,"Rt = runoff for current time step (in)"]
[19,114,3.3239999999999999E-2,1.7579999999999957E-3,null,null,null,null,null,null,null,"A = contributing area (ft)"]
[20,120,3.5000000000000003E-2,1.7600000000000046E-3,null,null,null,null,null,null,null,"dt = calculation time step (min)"]
[21,126,3.6775000000000002E-2,1.7749999999999988E-3]
[22,132,3.8578000000000001E-2,1.802999999999999E-3,null,null,null,null,null,null,null,"Qt = routed stormwater flow"]
[23,138,4.0411000000000002E-2,1.8330000000000013E-3,null,null,null,null,null,null,null,"w = routing function"]
[24,144,4.2271999999999997E-2,1.8609999999999946E-3,null,null,null,null,null,null,null,"Tc = time of concentration"]
[25,150,4.4163000000000001E-2,1.8910000000000038E-3]
[26,156,4.6081999999999998E-2,1.9189999999999971E-3,null,null,null,null,null,null,null,"n = Manning's roughness (0.011 for pavement)"]
[27,162,4.8030000000000003E-2,1.9480000000000053E-3,null,null,null,null,null,null,null,"L = flow lenth (ft; computed from tributary area)"]
[28,168,5.0007999999999997E-2,1.9779999999999937E-3,null,null,null,null,null,null,null,"P2 = 2-year, 24-hour rainfall (in)"]
[29,174,5.2013999999999998E-2,2.0060000000000008E-3,null,null,null,null,null,null,null,"s = 0.005 (ft/ft; assumed value)"]
[30,180,5.4050000000000001E-2,2.0360000000000031E-3,null,null,null,null,null,null,null,"Note: set minimum Tc = 5 minutes (Portland BES recommendation)"]
[31,186,5.6113999999999997E-2,2.0639999999999964E-3]
[32,192,5.8208000000000003E-2,2.0940000000000056E-3]
[33,198,6.0330000000000002E-2,2.1219999999999989E-3,null,null,"from TR-55 user manual… "]
[34,204,6.2482000000000003E-2,2.1520000000000011E-3]
[35,210,6.4661999999999997E-2,2.1799999999999944E-3]
[36,216,6.6872000000000001E-2,2.2100000000000036E-3]
[37,222,6.9110000000000005E-2,2.2380000000000039E-3]
[38,228,7.1377999999999997E-2,2.2679999999999922E-3]
[39,234,7.3675000000000004E-2,2.2970000000000074E-3]
[40,240,7.5999999999999998E-2,2.3249999999999937E-3]
[41,245.99999999999997,7.8344999999999998E-2,2.3449999999999999E-3]
[42,252,8.0701999999999996E-2,2.356999999999998E-3]
[43,258,8.3070000000000005E-2,2.368000000000009E-3]
[44,264,8.5447999999999996E-2,2.3779999999999912E-3]
[45,270,8.7836999999999998E-2,2.3890000000000022E-3]
[46,276,9.0237999999999999E-2,2.4010000000000004E-3]
[47,282,9.2648999999999995E-2,2.4109999999999965E-3]
[48,288,9.5072000000000004E-2,2.4230000000000085E-3]
[49,294,9.7504999999999994E-2,2.4329999999999907E-3]
[50,300,9.9949999999999997E-2,2.4450000000000027E-3]
[51,306,0.102405,2.4549999999999988E-3]
[52,312,0.10487200000000001,2.4670000000000109E-3]
[53,318,0.10735,2.4779999999999941E-3]
[54,324,0.10983800000000001,2.4880000000000041E-3]
[55,330,0.11233700000000001,2.4990000000000012E-3]
[56,336,0.11484800000000001,2.5109999999999993E-3]
{"$rows_left_out":185}
{"sheet":"Lookups, Constants","index":3,"n_rows":54,"n_cols":6,"rows_kept":54,"cut":false,"hidden":false,"merged":[[0,3,0,5]]}
["Lookup Tables for Combo Boxes",null,null,"Hydraulic Constants"]
[]
["DMA Type","Code",null,null,"Gravel layer porosity: ",0.4]
["Self-Treating","STA"]
["Self-Retaining","SRA"]
["Drains to SCM","2SCM"]
["Drains to Self-Retaining","2SRA"]
[]
["SCM Type"]
["Bioretention"]
["Direct Infiltration"]
[]
["DMA Surface Types","Curve Number","Runoff Factor (WQ)"]
["Roof",98,1]
["Concrete or asphalt",98,1]
["Grouted unit pavers",98,1]
["Pervious concrete",null,0]
["Porous asphalt",null,0]
["Unit pavers set in sand",89,0.5]
["Open/porous pavers",null,0]
["Crushed aggregate",null,0]
["Turfblock",null,0]
["Landscape",68,0.1]
[]
["SCM Optimization"]
["Area"]
["Depth"]
[]
["USA Lookup"]
["Yes"]
["No"]
[]
["Compliance Approach"]
["Tier 2 - Treatment"]
["Tier 2 - Storage"]
["Tier 3 - Retention"]
[]
["Infiltration Rate"]
["HSG A/B"]
["HSG C/D"]
["Site-Specific"]
[]
["Impervious Type","Code"]
["New","NEW"]
["Replaced","RPL"]
["Replaced within a USA","RUSA"]
[]
["Flow Control Orifice"]
["Yes"]
["No"]
[]
["Reservoir Selection"]
["Depth (in)"]
["Volume (ft3)"]